2-propyl-2-adamantanol

Kovats' RI, non-polar column, isothermal

View large format table.

Column type Active phase Temperature (C) I Reference Comment
CapillarySE-30145.1526.Burkhard, Vais, et al., 1969N2; Column length: 50. m; Column diameter: 0.27 mm
CapillarySE-30160.1543.Burkhard, Vais, et al., 1969N2; Column length: 50. m; Column diameter: 0.27 mm
CapillarySE-30175.1556.Burkhard, Vais, et al., 1969N2; Column length: 50. m; Column diameter: 0.27 mm
CapillarySE-30190.1572.Burkhard, Vais, et al., 1969N2; Column length: 50. m; Column diameter: 0.27 mm

Kovats' RI, polar column, isothermal

View large format table.

Column type Active phase Temperature (C) I Reference Comment
CapillaryCarbowax 20M160.2036.Burkhard, Vais, et al., 1969N2; Column length: 50. m; Column diameter: 0.27 mm
CapillaryCarbowax 20M175.2058.Burkhard, Vais, et al., 1969N2; Column length: 50. m; Column diameter: 0.27 mm

References

Burkhard, Vais, et al., 1969
Burkhard, J.; Vais, J.; Vodicka, L.; Landa, S., Adamantane and its derivatives. XVI. The gas chromatographic characterization of adamantane derivatives, J. Chromatogr., 1969, 42, 207-218, https://doi.org/10.1016/S0021-9673(01)80617-8 . [all data]