Naphtho[2,3-b]fluoranthene

Lee's RI, non-polar column, temperature ramp

Data compiled by: NIST Mass Spectrometry Data Center, William E. Wallace, director

Column type CapillaryCapillary
Active phase HP-5DB-5MS
Column length (m) 60.30.
Carrier gas He
Substrate
Column diameter (mm) 0.250.25
Phase thickness (μm) 0.250.25
Tstart (C) 35.60.
Tend (C) 300.320.
Heat rate (K/min) 3.5.
Initial hold (min)  3.
Final hold (min)  20.
I 538.5542.3
ReferenceMarynowski, Pieta, et al., 2004Sauvain and Duc, 2004
Comment MSDC-RI MSDC-RI

References

Marynowski, Pieta, et al., 2004
Marynowski, L.; Pieta, M.; Janeczek, J., Composition and source of polycyclic aromatic compounds in deposited dust from selected sites around the Upper Silesia, Poland, Geol. Q., 2004, 48, 2, 169-180. [all data]

Sauvain and Duc, 2004
Sauvain, J.-J.; Duc, T.V., Approaches to identifying and quantifying polycyclic aromatic hydrocarbons of molecular weight 302 in diesel particulates, J. Sep. Sci., 2004, 27, 1-2, 78-88, https://doi.org/10.1002/jssc.200301620 . [all data]