epi-ligulyl oxide

Normal alkane RI, non-polar column, temperature ramp

View large format table.

Column type Active phase I Reference Comment
CapillaryHP-51535.Yassa, Akhani, et al., 200330. m/0.25 mm/0.32 μm, He, 60. C @ 30. min, 5. K/min; Tend: 250. C

Normal alkane RI, non-polar column, custom temperature program

View large format table.

Column type Active phase I Reference Comment
CapillaryDB-51554.Hamm, Bleton, et al., 200430. m/0.25 mm/0.25 μm, He; Program: 40C(1min) => 9C/min => 130C => 2C/min => 230C

References

Yassa, Akhani, et al., 2003
Yassa, N.; Akhani, H.; Aqaahmadi, M.; Salimian, M., Essential oils from two endemic species of Apiaceae from Iran, Z. Naturforsch. C:, 2003, 58, 459-463. [all data]

Hamm, Bleton, et al., 2004
Hamm, S.; Bleton, J.; Tchapla, A., Headspace solid phase microextraction for screening for the presence of resins in Egyptian archaeological samples, J. Sep. Sci., 2004, 27, 3, 235-243, https://doi.org/10.1002/jssc.200301611 . [all data]