trans-Dihydroagarofuran

Normal alkane RI, non-polar column, temperature ramp

View large format table.

Column type Active phase I Reference Comment
CapillaryDB-11489.Salgueiro, Vila, et al., 19976. K/min; Tstart: 80. C; Tend: 220. C

Normal alkane RI, non-polar column, custom temperature program

View large format table.

Column type Active phase I Reference Comment
CapillaryDB-11489.Miguel, Simões, et al., 200430. m/0.25 mm/0.25 μm, He; Program: 45C => 3C/min => 175C => 15C/min => 300C (10min)

References

Salgueiro, Vila, et al., 1997
Salgueiro, L.R.; Vila, R.; Tomi, F.; Figueiredo, A.C.; Barroso, J.G.; Cañigueral, S.; Casanova, J.; da Cunha, A.P.; Adzet, T., Variability of essential oils of Thymus caespititius from Portugal, Phytochemistry, 1997, 45, 2, 307-311, https://doi.org/10.1016/S0031-9422(96)00872-2 . [all data]

Miguel, Simões, et al., 2004
Miguel, G.; Simões, M.; Figueiredo, A.C.; Barroso, J.G.; Pedro, L.G.; Carvalho, L., Composition and antioxidant activities of the essential oils of Thymus caespititius, Thymus camphoratus and Thymus mastichina, Food Chem., 2004, 86, 2, 183-188, https://doi.org/10.1016/j.foodchem.2003.08.031 . [all data]