trans-α-Irone

Kovats' RI, non-polar column, isothermal

View large format table.

Column type Active phase Temperature (C) I Reference Comment
CapillarySPB-1132.1491.Misharina, Samusenko, et al., 200237. m/0.32 mm/0.25 μm, He
CapillarySPB-1143.1496.Misharina, Samusenko, et al., 200237. m/0.32 mm/0.25 μm, He
CapillarySPB-1152.1502.Misharina, Samusenko, et al., 200237. m/0.32 mm/0.25 μm, He
CapillarySPB-1162.1504.Misharina, Samusenko, et al., 200237. m/0.32 mm/0.25 μm, He

Van Den Dool and Kratz RI, non-polar column, temperature ramp

View large format table.

Column type Active phase I Reference Comment
CapillarySPB-11501.Misharina, Samusenko, et al., 200237. m/0.32 mm/0.25 μm, He, 8. K/min; Tstart: 100. C; Tend: 250. C

References

Misharina, Samusenko, et al., 2002
Misharina, T.A.; Samusenko, A.L.; Belyaeva, N.V., Gas chromatographic and IR spectroscopic characteristics of tri- and tetramethylcyclohexenyl butenyl ketones, Russ. Chem. Bull. (Engl. Transl.), 2002, 51, 9, 1684-1688, https://doi.org/10.1023/A:1021347404479 . [all data]