6-epi-β-Cubebene

Van Den Dool and Kratz RI, non-polar column, custom temperature program

View large format table.

Column type Active phase I Reference Comment
CapillaryCP Sil 5 CB1449.Kasali, Ekundayo, et al., 2002H2; Column length: 25. m; Program: not specified

References

Kasali, Ekundayo, et al., 2002
Kasali, A.A.; Ekundayo, O.; Paul, C.; König, W.A., epi-Cubebanes from Solidago canadensis, Phytochemistry, 2002, 59, 8, 805-810, https://doi.org/10.1016/S0031-9422(02)00006-7 . [all data]