(-)-Myltayl-8(12)-ene

Van Den Dool and Kratz RI, non-polar column, custom temperature program

View large format table.

Column type Active phase I Reference Comment
CapillaryCP Sil 5 CB1455.Adio, Paul, et al., 2002H2; Column length: 25. m; Program: not specified
CapillaryCP Sil 5 CB1455.Martins Adio, Paul, et al., 2002Column length: 25. m; Program: not specified

References

Adio, Paul, et al., 2002
Adio, A.M.; Paul, C.; König, W.A.; Muhle, H., Volatile components from European liverworts Marsupella emarginata, M. aquatica and M. alpina, Phytochemistry, 2002, 61, 1, 79-91, https://doi.org/10.1016/S0031-9422(02)00214-5 . [all data]

Martins Adio, Paul, et al., 2002
Martins Adio, A.; Paul, C.; König, W.A.; Muhle, H., Volatile components from European liverworts Marsupella emarginata, M. aquatica and M. alpina, Phytochemistry, 2002, 61, 1, 79-91, https://doi.org/10.1016/S0031-9422(02)00214-5 . [all data]