5-Methyl-5-ethenyldihydro-2(3H)-furanone

Normal alkane RI, polar column, custom temperature program

Data compiled by: NIST Mass Spectrometry Data Center, William E. Wallace, director

Column type Capillary
Active phase Carbowax 20M
Column length (m)
Carrier gas
Substrate
Column diameter (mm)
Phase thickness (μm)
Program not specified
I 1639.
ReferenceEditorial paper, 2005
Comment MSDC-RI

References

Editorial paper, 2005
Editorial paper, Solid Phase Microextraction (SPME) Application Guide, The Reporter Europe (Supelco), 2005, 16, 5, 12-12. [all data]