trans-Vitispirane

Normal alkane RI, polar column, custom temperature program

Data compiled by: NIST Mass Spectrometry Data Center, William E. Wallace, director

Column type Capillary
Active phase DB-Wax
Column length (m) 30.
Carrier gas He
Substrate
Column diameter (mm) 0.25
Phase thickness (μm) 0.5
Program 30C => 70C/min => 60C (3min) => 3C/min => 245C (20min)
I 1553.
ReferenceSchneider, Razungles, et al., 2001
Comment MSDC-RI

References

Schneider, Razungles, et al., 2001
Schneider, R.; Razungles, A.; Augier, C.; Baumes, R., Monoterpenic and norisoprenoidic glycoconjugates of Vitis vinifera L. cv. Melon B. as precursors of odorants in Muscadet wines, J. Chromatogr. A, 2001, 936, 1-2, 145-157, https://doi.org/10.1016/S0021-9673(01)01150-5 . [all data]