(Z)-β-Damascone

Kovats' RI, non-polar column, custom temperature program

Data compiled by: NIST Mass Spectrometry Data Center, William E. Wallace, director

Column type CapillaryCapillary
Active phase HP-5HP-5
Column length (m) 30.30.
Carrier gas HeHe
Substrate
Column diameter (mm) 0.250.25
Phase thickness (μm) 0.250.25
Program 50 C 20 C/min -> 70 C 9 C/min -> 280 C50 0C 20 K/min -> 70 0C 9 K/min -> 280 0C
I 1383.1383.
ReferencePalic, Stojanovic, et al., 2002Stojanovic, Palic, et al., 2000
Comment MSDC-RI MSDC-RI

Normal alkane RI, non-polar column, custom temperature program

Data compiled by: NIST Mass Spectrometry Data Center, William E. Wallace, director

Column type Capillary
Active phase DB-5
Column length (m) 30.
Carrier gas Helium
Substrate
Column diameter (mm) 0.25
Phase thickness (μm) 0.25
Program not specified
I 1383.
ReferenceBastos, Ishimoto, et al., 2008
Comment MSDC-RI

References

Palic, Stojanovic, et al., 2002
Palic, R.; Stojanovic, G.; Alagic, S.; Nikolic M.; Lepojevic, Z., Chemical composition and antimicrobial activity of the essential oil and CO2 extracts of the oriental tobacco, Prilep, Flavour Fragr. J., 2002, 17, 5, 323-326, https://doi.org/10.1002/ffj.1084 . [all data]

Stojanovic, Palic, et al., 2000
Stojanovic, G.; Palic, R.; Alagic, S.; Zekovic, Z., Chemical composition and antimicrobial activity of the essential oil and CO2 extracts of semi-oriental tobacco, Otlja, Flavour Fragr. J., 2000, 15, 5, 335-338, https://doi.org/10.1002/1099-1026(200009/10)15:5<335::AID-FFJ921>3.0.CO;2-W . [all data]