trans-3-acetoxy-1,8-cineole

Normal alkane RI, polar column, temperature ramp

View large format table.

Column type Active phase I Reference Comment
CapillaryDB-Wax1749.Kubota, Nakamura, et al., 199860. m/0.25 mm/0.25 μm, He, 60. C @ 4. min, 2. K/min; Tend: 200. C

References

Kubota, Nakamura, et al., 1998
Kubota, K.; Nakamura, K.; Kobayashi, A., Acetoxy-1,8-cineoles as aroma constituents of Alpinia galanga Willd, J. Agric. Food Chem., 1998, 46, 12, 5244-5247, https://doi.org/10.1021/jf9804239 . [all data]