2-propenylfuran

Van Den Dool and Kratz RI, polar column, temperature ramp

View large format table.

Column type Active phase I Reference Comment
CapillaryCP-WAX 57CB1183.Baltes and Mevissen, 1988He, 50. C @ 5. min, 2. K/min; Column length: 50. m; Column diameter: 0.24 mm; Tend: 210. C

Van Den Dool and Kratz RI, polar column, custom temperature program

View large format table.

Column type Active phase I Reference Comment
CapillaryCarbowax1183.Baltes w. and Bochmann G., 1987Column diameter: 0.3 mm; Program: not specified
CapillaryCarbowax1183.Baltes w. and Bochmann G., 1987Column diameter: 0.3 mm; Program: not specified
CapillaryCarbowax1184.Baltes w. and Bochmann G., 1987Column diameter: 0.3 mm; Program: not specified
CapillaryCarbowax1185.Baltes w. and Bochmann G., 1987Column diameter: 0.3 mm; Program: not specified
CapillaryCarbowax1185.Baltes w. and Bochmann G., 1987Column diameter: 0.3 mm; Program: not specified

Normal alkane RI, polar column, temperature ramp

View large format table.

Column type Active phase I Reference Comment
CapillaryHP-Wax1220.Sanz, Ansorena, et al., 200160. m/0.25 mm/0.5 μm, He, 40. C @ 6. min, 3. K/min; Tend: 190. C
CapillaryDB-Wax1196.Horiuchi, Umano, et al., 199860. m/0.25 mm/1. μm, He, 3. K/min, 200. C @ 40. min; Tstart: 50. C

References

Baltes and Mevissen, 1988
Baltes, W.; Mevissen, L., Model reactions on roast aroma formation. VI. Volatile reaction products from the reaction of phenylalanine with glucose during cooking and roasting, Z. Lebensm. Unters. Forsch., 1988, 187, 3, 209-214, https://doi.org/10.1007/BF01043341 . [all data]

Baltes w. and Bochmann G., 1987
Baltes w.; Bochmann G., Model reactions on roast aroma formation. II. Mass spectrometric identification of furans and furanones from the reaction of serine and threonine with sucrose under the conditions of coffee roasting, Z. Lebensm. Unters. Forsch., 1987, 184, 179-186. [all data]

Sanz, Ansorena, et al., 2001
Sanz, C.; Ansorena, D.; Bello, J.; Cid, C., Optimizing headspace temperature and time sampling for identification of volatile compounds in ground roasted Arabica coffee, J. Agric. Food Chem., 2001, 49, 3, 1364-1369, https://doi.org/10.1021/jf001100r . [all data]

Horiuchi, Umano, et al., 1998
Horiuchi, M.; Umano, K.; Shibamoto, T., Analysis of volatile compounds formed from fish oil heated with cysteine and trimethylamine oxide, J. Agric. Food Chem., 1998, 46, 12, 5232-5237, https://doi.org/10.1021/jf980482m . [all data]