1,3,5-Octatriene

Van Den Dool and Kratz RI, polar column, custom temperature program

Data compiled by: NIST Mass Spectrometry Data Center, William E. Wallace, director

Column type Capillary
Active phase DB-Wax
Column length (m) 30.
Carrier gas He
Substrate
Column diameter (mm) 0.32
Phase thickness (μm) 0.5
Program 40C(5min) => 10C/min => 160C => 15C/min => 230C
I 1100.
ReferenceHallier, Prost, et al., 2005
Comment MSDC-RI

References

Hallier, Prost, et al., 2005
Hallier, A.; Prost, C.; Serot, T., Influence in rearing conditions on the volatile compounds of cooked fillets of Silurus glanis (European catfish), J. Agric. Food Chem., 2005, 53, 18, 7204-7211, https://doi.org/10.1021/jf050559o . [all data]