17-Methyltetratriacontane

Van Den Dool and Kratz RI, non-polar column, temperature ramp

Data compiled by: NIST Mass Spectrometry Data Center, William E. Wallace, director

Column type CapillaryCapillaryCapillary
Active phase Ultra-1HT-5HT-5
Column length (m) 12.25.25.
Carrier gas  N2N2
Substrate
Column diameter (mm) 0.20.530.53
Phase thickness (μm)  0.220.22
Tstart (C) 150.150.150.
Tend (C) 320.320.320.
Heat rate (K/min) 4.15.15.
Initial hold (min) 4.
Final hold (min) 30.20.20.
I 3430.3423.3423.
ReferenceNelson, Adams, et al., 2003Goh S.H., Ooi K.E., et al., 1993Goh S.H., Ooi K.E., et al., 1993
Comment MSDC-RI MSDC-RI MSDC-RI

References

Nelson, Adams, et al., 2003
Nelson, D.R.; Adams, T.S.; Fatland, C.L., Hydrocarbons in the surface wax of eggs and adults of the Colorado potato beetle, Leptinotarsa decemlineata, Comp. Biochem. Physiol. B: Comp. Biochem., 2003, 134, 3, 447-466, https://doi.org/10.1016/S1096-4959(02)00262-2 . [all data]

Goh S.H., Ooi K.E., et al., 1993
Goh S.H.; Ooi K.E.; Chuah C.H.; Yong H.S.; Khoo S.G.; Ong S.H., Cuticular hydrocarbons from two species of Malaysian Bactrocera fruit flies, Biochem. Syst. Ecol., 1993, 21, 2, 215-226, https://doi.org/10.1016/0305-1978(93)90039-T . [all data]