14,18-dimethyl-tetratriacontane

Normal alkane RI, non-polar column, custom temperature program

Data compiled by: NIST Mass Spectrometry Data Center, William E. Wallace, director

Column type Capillary
Active phase Dexsil 300
Column length (m) 15.
Carrier gas
Substrate
Column diameter (mm)
Phase thickness (μm)
Program 50 0C 5 0C/min -> 200 0C 2 0C/min -> 340 0C
I 3452.
ReferenceLockey, 1981
Comment MSDC-RI

References

Lockey, 1981
Lockey, K.H., Cuticular hydrocarbons of adult Cylindrinotus laevioctostriatus (Goeze) and Phylan gibbus (Fabricius) (Coleoptera: Tenebrionidae), Insect. Biochem., 1981, 11, 5, 549-561, https://doi.org/10.1016/0020-1790(81)90023-8 . [all data]