7-senecioyllycopsamine

Kovats' RI, non-polar column, temperature ramp

View large format table.

Column type Active phase I Reference Comment
CapillaryDB-12497.El-Shazly, Sarg, et al., 1996He, 170. C @ 5. min, 10. K/min, 300. C @ 15. min; Column length: 30. m

Normal alkane RI, non-polar column, custom temperature program

View large format table.

Column type Active phase I Reference Comment
CapillaryDB-12495.Frolich, Ober, et al., 2007Column length: 30. m; Column diameter: 0.32 mm; Program: not specified

References

El-Shazly, Sarg, et al., 1996
El-Shazly, A.; Sarg, T.; Ateya, A.; Abdel Aziz, E.; El-Dahmy, S.; Witte, L.; Wink, M., Pyrrolizidine and tetrahydroisoquinoline alkaloids from Echium humile, Phytochemistry, 1996, 42, 1, 225-230, https://doi.org/10.1016/0031-9422(95)00847-0 . [all data]

Frolich, Ober, et al., 2007
Frolich, C.; Ober, D.; Hartmann, T., Tissue distribution, core biosynthesis and diversification of pyrrolizidine alkaloids of the lycopsamine type in three Boraginaceae species, Phytochemistry, 2007, 68, 7, 1026-1037, https://doi.org/10.1016/j.phytochem.2007.01.002 . [all data]