GA91, MeTMS

Van Den Dool and Kratz RI, non-polar column, custom temperature program

View large format table.

Column type Active phase I Reference Comment
CapillaryOV-12736.Santes, Hedden, et al., 199525. m/0.2 mm/0.25 μm; Program: 60C(2min) => 10C/min => 150C => 3C/min => 300C
CapillaryOV-12738.Santes, Hedden, et al., 199525. m/0.2 mm/0.25 μm; Program: 60C(2min) => 10C/min => 150C => 3C/min => 300C

Normal alkane RI, non-polar column, custom temperature program

View large format table.

Column type Active phase I Reference Comment
CapillaryMethyl Silicone2738.Penny, Willis, et al., 1994Program: not specified
CapillaryMethyl Silicone2739.Penny, Willis, et al., 1994Program: not specified

References

Santes, Hedden, et al., 1995
Santes, C.M.; Hedden, P.; Gaskin, P.; Garcia-Martinez, J.L., Gibberellins and related compounds in young fruits of pea and their relationship to fruit-set, Phytochemistry, 1995, 40, 5, 1347-1355, https://doi.org/10.1016/0031-9422(95)00489-T . [all data]

Penny, Willis, et al., 1994
Penny, M.; Willis, C.L.; Gaskin, P.; Lenton, J.R., Preparation of gibberellins A91 and A92 and their occurence in developing wheat grain, Phytochemistry, 1994, 37, 4, 1063-1067, https://doi.org/10.1016/S0031-9422(00)89529-1 . [all data]