2-methyl-3-tetrahydrofurylthiol

Van Den Dool and Kratz RI, polar column, temperature ramp

Data compiled by: NIST Mass Spectrometry Data Center, William E. Wallace, director

Column type CapillaryCapillary
Active phase DB-WaxDB-Wax
Column length (m) 60.60.
Carrier gas HeHe
Substrate
Column diameter (mm) 0.250.25
Phase thickness (μm) 0.250.25
Tstart (C) 35.35.
Tend (C) 210.210.
Heat rate (K/min) 2.2.
Initial hold (min) 5.5.
Final hold (min) 30.30.
I 1299.1381.
ReferenceRuther and Baltes, 1994Ruther and Baltes, 1994
Comment MSDC-RI MSDC-RI

References

Ruther and Baltes, 1994
Ruther, J.; Baltes, W., Sulfur-containing furans in commercial meat flavorings, J. Agric. Food Chem., 1994, 42, 10, 2254-2259, https://doi.org/10.1021/jf00046a032 . [all data]