2,6-dimethyloct-7-ene-2,3,6-triol

Van Den Dool and Kratz RI, polar column, temperature ramp

View large format table.

Column type Active phase I Reference Comment
CapillaryCarbowax 20M2425.Schwab, Mahr, et al., 198930. m/0.25 mm/0.25 μm, He, 40. C @ 3. min, 4. K/min; Tend: 240. C

References

Schwab, Mahr, et al., 1989
Schwab, W.; Mahr, C.; Schreier, P., Studies on the enzymic hydrolysis of bound aroma components from Carica papaya fruit, J. Agric. Food Chem., 1989, 37, 4, 1009-1012, https://doi.org/10.1021/jf00088a042 . [all data]