3-epi-GA1-3α-O-glucoside, permethylated

Kovats' RI, non-polar column, temperature ramp

Data compiled by: NIST Mass Spectrometry Data Center, William E. Wallace, director

Column type Capillary
Active phase Methyl Silicone
Column length (m) 25.
Carrier gas He
Substrate
Column diameter (mm) 0.31
Phase thickness (μm) 0.17
Tstart (C) 60.
Tend (C) 260.
Heat rate (K/min) 25.
Initial hold (min) 1.
Final hold (min)
I 3625.
ReferenceSchmidt, Schneider, et al., 1988
Comment MSDC-RI

References

Schmidt, Schneider, et al., 1988
Schmidt, J.; Schneider, G.; Jensen, E., Capillary gas chromatography/mass spectrometry of permethylated gibberellin glucosides, Biomed. Environ. Mass Spectrom., 1988, 17, 1, 7-13, https://doi.org/10.1002/bms.1200170105 . [all data]