Dibenzofuran, 1,4,6,9-tetrachloro

Van Den Dool and Kratz RI, non-polar column, temperature ramp

View large format table.

Column type Active phase I Reference Comment
CapillaryDB-52363.Waddell, McKinnon, et al., 198730. m/0.25 mm/0.25 μm, He, 90. C @ 4. min, 15. K/min; Tend: 320. C
CapillaryDB-52314.Hale, Hileman, et al., 1985He, 175. C @ 1. min, 6. K/min; Column length: 30. m; Tend: 180. C

Van Den Dool and Kratz RI, non-polar column, custom temperature program

View large format table.

Column type Active phase I Reference Comment
CapillaryHP-52319.Korhonen and Mantykoski, 198925. m/0.20 mm/0.11 μm, He; Program: 100 0C (1 min) 20 0C/min -> 180 0C 5 0C/min -> 290 0C (until elution of the last peak)

Normal alkane RI, non-polar column, custom temperature program

View large format table.

Column type Active phase I Reference Comment
CapillaryDB-52314.N/AProgram: not specified

References

Waddell, McKinnon, et al., 1987
Waddell, D.S.; McKinnon, H.S.; Chittim, B.G.; Safe, S.; Boyd, R.K., Gas chromatographic/mass spectrometric characteristics of purified synthetic isomers of tetrachlorodibenzofuran, Biomed. Environ. Mass Spectrom., 1987, 14, 8, 457-464, https://doi.org/10.1002/bms.1200140813 . [all data]

Hale, Hileman, et al., 1985
Hale, M.D.; Hileman, F.D.; Mazer, T.; Shell, T.L.; Noble, R.W.; Brooks, J.J., Mathematical modeling of temperature programmed capillary gas chromatographic retention indexes for polychlorinated dibenzofurans, Anal. Chem., 1985, 57, 3, 640-648, https://doi.org/10.1021/ac00280a017 . [all data]

Korhonen and Mantykoski, 1989
Korhonen, I.O.O.; Mantykoski, K.M., Gas-Liquid Chromatographic Analyses. L. Retention, Dispersion and Selectivity Indices of Polychlorinated Dibenzo-p-dioxins and Dibenzofurans, J. Chromatogr., 1989, 477, 2, 327-336, https://doi.org/10.1016/S0021-9673(01)89641-2 . [all data]