3-heptanethiol

Kovats' RI, polar column, isothermal

View large format table.

Column type Active phase Temperature (C) I Reference Comment
CapillaryPEG-20M93.1157.6Morishita, Murakita, et al., 1985Column length: 50. m; Column diameter: 0.25 mm
CapillaryPEG-20M80.1153.2Morishita, Murakita, et al., 1982N2; Column length: 50. m; Column diameter: 0.25 mm

References

Morishita, Murakita, et al., 1985
Morishita, F.; Murakita, H.; Kojima, T., Prediction of retention indices of thiols and sulfides under different conditions of capillary gas chromatography, Bunseki Kagaku, 1985, 34, 12, 800-802, https://doi.org/10.2116/bunsekikagaku.34.12_800 . [all data]

Morishita, Murakita, et al., 1982
Morishita, F.; Murakita, H.; Takemura, Y.; Kojima, T., Prediction of molecular structures of thiols and sulphides by retention indices, J. Chromatogr., 1982, 239, 483-492, https://doi.org/10.1016/S0021-9673(00)82005-1 . [all data]