2,3,5-Trimethylheptane, threo

Kovats' RI, non-polar column, isothermal

View large format table.

Column type Active phase Temperature (C) I Reference Comment
CapillaryVacuum Grease Oil (VM-4)95.912.3Sultanov and Arustamova, 1975N2; Column length: 150. m; Column diameter: 0.25 mm

References

Sultanov and Arustamova, 1975
Sultanov, N.T.; Arustamova, L.G., Determination of the boiling points of C10 isoalkanes in an n-decane isomerizate from gas chromatographic retention indices, J. Chromatogr., 1975, 115, 2, 553-558, https://doi.org/10.1016/S0021-9673(01)98959-9 . [all data]