4,5-dimethyloctane, meso

Kovats' RI, non-polar column, isothermal

View large format table.

Column type Active phase Temperature (C) I Reference Comment
CapillaryVacuum Grease Oil (VM-4)95.942.8Sultanov and Arustamova, 1975N2; Column length: 150. m; Column diameter: 0.25 mm
CapillarySqualane80.944.5Schomburg, 1967Ar; Column length: 100. m

References

Sultanov and Arustamova, 1975
Sultanov, N.T.; Arustamova, L.G., Determination of the boiling points of C10 isoalkanes in an n-decane isomerizate from gas chromatographic retention indices, J. Chromatogr., 1975, 115, 2, 553-558, https://doi.org/10.1016/S0021-9673(01)98959-9 . [all data]

Schomburg, 1967
Schomburg, G., Struktur und Retentionsverhalten von Offenkettigen und Cyclischen Kohlenwasserstoffen und Deren Einfacher Substitutionsprodukte, Anal. Chim. Acta., 1967, 38, 45-64, https://doi.org/10.1016/S0003-2670(01)80560-2 . [all data]