4-mercaptopentyl-2-acetate

Normal alkane RI, non-polar column, custom temperature program

View large format table.

Column type Active phase I Reference Comment
CapillaryCP Sil 5 CB1053.Vermeulen and Collin, 200350. m/0.32 mm/1.2 μm, He; Program: 40C(4min) => 2C/min => 132C => 10C/min => 250C(45min)
CapillaryCP Sil 5 CB1063.Vermeulen and Collin, 200350. m/0.32 mm/1.2 μm, He; Program: not specified

Normal alkane RI, polar column, custom temperature program

View large format table.

Column type Active phase I Reference Comment
CapillaryFFAP1509.Vermeulen and Collin, 200325. m/0.32 mm/0.3 μm; Program: 40C(4min) => 2C/min => 132C => 10C/min => 250C (15min)
CapillaryFFAP1531.Vermeulen and Collin, 200325. m/0.32 mm/0.3 μm; Program: 40C(4min) => 2C/min => 132C => 10C/min => 250C (15min)

References

Vermeulen and Collin, 2003
Vermeulen, C.; Collin, S., Combinatorial synthesis and sensorial properties of 21 mercapto esters, J. Agric. Food Chem., 2003, 51, 12, 3618-3622, https://doi.org/10.1021/jf021138z . [all data]