1-mercaptobutyl-3-acetate

Normal alkane RI, non-polar column, custom temperature program

Data compiled by: NIST Mass Spectrometry Data Center, William E. Wallace, director

Column type Capillary
Active phase CP Sil 5 CB
Column length (m) 50.
Carrier gas He
Substrate
Column diameter (mm) 0.32
Phase thickness (μm) 1.2
Program 40C(4min) => 2C/min => 132C => 10C/min => 250C(45min)
I 1025.
ReferenceVermeulen and Collin, 2003
Comment MSDC-RI

References

Vermeulen and Collin, 2003
Vermeulen, C.; Collin, S., Combinatorial synthesis and sensorial properties of 21 mercapto esters, J. Agric. Food Chem., 2003, 51, 12, 3618-3622, https://doi.org/10.1021/jf021138z . [all data]