Myrcene dimer

Normal alkane RI, polar column, temperature ramp

Data compiled by: NIST Mass Spectrometry Data Center, William E. Wallace, director

Column type CapillaryCapillaryCapillary
Active phase DB-WaxDB-WaxDB-Wax
Column length (m) 60.60.60.
Carrier gas N2N2N2
Substrate
Column diameter (mm) 0.250.250.25
Phase thickness (μm) 0.250.250.25
Tstart (C) 70.70.70.
Tend (C) 230.230.230.
Heat rate (K/min) 2.2.2.
Initial hold (min) 2.2.2.
Final hold (min) 20.20.20.
I 2178.2226.2237.
ReferenceTu, Onishi, et al., 2003Tu, Onishi, et al., 2003Tu, Onishi, et al., 2002
Comment MSDC-RI MSDC-RI MSDC-RI

References

Tu, Onishi, et al., 2003
Tu, N.T.M.; Onishi, Y.; Son, U.S.; Ogawa, E.; Ukeda, H.; Sawamura, M., Characteristic odour components of Citrus inflata Hort. Ex Tanaka (Mochiyu) cold-pressed peel oil, Flavour Fragr. J., 2003, 18, 5, 454-459, https://doi.org/10.1002/ffj.1252 . [all data]

Tu, Onishi, et al., 2002
Tu, N.T.M.; Onishi, Y.; Choi, H.-S.; Kondo, Y.; Bassore, S.M.; Ukeda, H.; Sawamura, M., Characteristic odor components of Citrus sphaerocarpa Tanaka (Kabosu) cold-pressed peel oil, J. Agric. Food Chem., 2002, 50, 10, 2908-2913, https://doi.org/10.1021/jf011578a . [all data]