R,S-4'-methyl-α-pyrrolidinohexanophenone-M (oxo-carboxy-HO-alkyl-), ethylated

Kovats' RI, non-polar column, temperature ramp

View large format table.

Column type Active phase I Reference Comment
CapillaryHP-12640.Springer, Peters, et al., 200312. m/0.2 mm/0.33 μm, He, 100. C @ 3. min, 30. K/min, 310. C @ 8. min
CapillaryHP-12665.Springer, Peters, et al., 200312. m/0.2 mm/0.33 μm, He, 100. C @ 3. min, 30. K/min, 310. C @ 8. min

References

Springer, Peters, et al., 2003
Springer, D.; Peters, F.T.; Fritschi, G.; Maurer, H.H., New designer drug 4'-methyl-α-pyrrolidinohexanophenone: studies on its metabolism and toxicological detection in urine using gas chromatography-mass spectrometry, J. Chromatogr. B, 2003, 789, 1, 79-91, https://doi.org/10.1016/S1570-0232(03)00043-6 . [all data]