1,2,3,4,6-pentachlorodibenzofuran

Van Den Dool and Kratz RI, non-polar column, temperature ramp

View large format table.

Column type Active phase I Reference Comment
CapillaryDB-52530.Chittim, Madge, et al., 1986He, 2. K/min; Column length: 60. m; Tstart: 100. C; Tend: 320. C
CapillaryDB-52496.Hale, Hileman, et al., 1985He, 175. C @ 1. min, 6. K/min; Column length: 30. m; Tend: 180. C

Van Den Dool and Kratz RI, non-polar column, custom temperature program

View large format table.

Column type Active phase I Reference Comment
CapillaryHP-52504.Korhonen and Mantykoski, 198925. m/0.20 mm/0.11 μm, He; Program: 100 0C (1 min) 20 0C/min -> 180 0C 5 0C/min -> 290 0C (until elution of the last peak)

Normal alkane RI, non-polar column, custom temperature program

View large format table.

Column type Active phase I Reference Comment
CapillaryDB-52496.N/AProgram: not specified

References

Chittim, Madge, et al., 1986
Chittim, B.G.; Madge, J.A.; Safe, S.H., Pentachlorodibenzofurans: synthesis, capillary gas chromatography and gas chromatographic/mass spectrometric characteristics, Chemosphere, 1986, 15, 9-12, 1931-1934, https://doi.org/10.1016/0045-6535(86)90486-8 . [all data]

Hale, Hileman, et al., 1985
Hale, M.D.; Hileman, F.D.; Mazer, T.; Shell, T.L.; Noble, R.W.; Brooks, J.J., Mathematical modeling of temperature programmed capillary gas chromatographic retention indexes for polychlorinated dibenzofurans, Anal. Chem., 1985, 57, 3, 640-648, https://doi.org/10.1021/ac00280a017 . [all data]

Korhonen and Mantykoski, 1989
Korhonen, I.O.O.; Mantykoski, K.M., Gas-Liquid Chromatographic Analyses. L. Retention, Dispersion and Selectivity Indices of Polychlorinated Dibenzo-p-dioxins and Dibenzofurans, J. Chromatogr., 1989, 477, 2, 327-336, https://doi.org/10.1016/S0021-9673(01)89641-2 . [all data]