3β-hydroxy-13-epi-manoyl oxide

Van Den Dool and Kratz RI, non-polar column, temperature ramp

View large format table.

Column type Active phase I Reference Comment
CapillaryHP-52239.Skaltsa, Demetzos, et al., 200330. m/0.25 mm/0.25 μm, He, 60. C @ 5. min, 4. K/min; Tend: 280. C
CapillaryHP-5MS2270.Demetzos, Angelopoulou, et al., 200230. m/0.25 mm/0.25 μm, 50. C @ 5. min, 3. K/min; Tend: 280. C

References

Skaltsa, Demetzos, et al., 2003
Skaltsa, H.D.; Demetzos, C.; Lazari, D.; Sokovic, M., Essential oil analysis and antimicrobial activity of eight Stachys species from Greece, Phytochemistry, 2003, 64, 3, 743-752, https://doi.org/10.1016/S0031-9422(03)00386-8 . [all data]

Demetzos, Angelopoulou, et al., 2002
Demetzos, C.; Angelopoulou, D.; Perdetzoglou, D., A comparative study of the essential oils of Cistus salviifolius in several populations of Crete (Greece), Biochem. Syst. Ecol., 2002, 30, 7, 651-665, https://doi.org/10.1016/S0305-1978(01)00145-4 . [all data]