Germacrane-b

Kovats' RI, non-polar column, isothermal

View large format table.

Column type Active phase Temperature (C) I Reference Comment
PackedSF-96150.1475.Maarse, 1975Chromosorb W-AW; Column length: 3.0 m
PackedSF-96150.1476.Maarse, 1975Chromosorb W-AW; Column length: 3.0 m
PackedSF-96150.1477.Maarse, 1975Chromosorb W-AW; Column length: 3.0 m

Kovats' RI, polar column, isothermal

View large format table.

Column type Active phase Temperature (C) I Reference Comment
PackedCarbowax 20M130.1572.Maarse, 1975Chromosorb W-AW; Column length: 3.0 m

Normal alkane RI, non-polar column, temperature ramp

View large format table.

Column type Active phase I Reference Comment
CapillaryDB-11492.Rasooli and Mirmostafa, 200360. m/0.25 mm/0.25 μm, He, 4. K/min; Tstart: 40. C; Tend: 220. C

References

Maarse, 1975
Maarse, H., Hydrogenolysis of terpenes in the injection port of a gas chromatograph. II. Sesquiterpenes, J. Chromatogr., 1975, 106, 2, 369-384, https://doi.org/10.1016/S0021-9673(00)93846-9 . [all data]

Rasooli and Mirmostafa, 2003
Rasooli, I.; Mirmostafa, S.A., Bacterial susceptibility to and chemical composition of essential oils from Thymus kotschyanus and Thymus persicus, J. Agric. Food Chem., 2003, 51, 8, 2200-2205, https://doi.org/10.1021/jf0261755 . [all data]