Californine-M (nor-demethylene-methyl-) 2AC

Kovats' RI, non-polar column, temperature ramp

View large format table.

Column type Active phase I Reference Comment
CapillaryCross-Linked Methylsilicone3220.Paul and Maurer, 200312. m/0.2 mm/0.33 μm, He, 100. C @ 3. min, 30. K/min, 310. C @ 8. min

References

Paul and Maurer, 2003
Paul, L.D.; Maurer, H.H., Studies on the metabolism and toxicological detection of the Eschscholtzia californica alkaloids californine and protopine in urine using gas chromatography-mass spectrometry, J. Chromatogr. B, 2003, 789, 1, 43-57, https://doi.org/10.1016/S1570-0232(03)00124-7 . [all data]