4-epi-Abietal

Normal alkane RI, non-polar column, temperature ramp

Data compiled by: NIST Mass Spectrometry Data Center, William E. Wallace, director

Column type CapillaryCapillaryCapillary
Active phase HP-5 MSHP-5DB-5
Column length (m) 30.30.30.
Carrier gas HeliumN2He
Substrate
Column diameter (mm) 0.250.250.25
Phase thickness (μm) 0.250.250.25
Tstart (C) 50.50.60.
Tend (C) 230.240.280.
Heat rate (K/min) 3.5.3.
Initial hold (min) 10.1.
Final hold (min) 10.4.30.
I 2288.2288.2268.
ReferenceAdams, Beauchamp, et al., 2007Cheraif, Ben Jannet, et al., 2007Marongiu, Porcedda, et al., 2003
Comment MSDC-RI MSDC-RI MSDC-RI

References

Adams, Beauchamp, et al., 2007
Adams, R.P.; Beauchamp, P.S.; Dev, V.; Dutz, S.M., New Natural Products Isolated from One-Seeded Juniperus of the Southwestern United States: Isolation and Occurence of 2-Ethenyl-3-methyl Phanol and Its Derivatives, J. Essent. Oil Res., 2007, 19, 2, 146-152, https://doi.org/10.1080/10412905.2007.9699247 . [all data]

Cheraif, Ben Jannet, et al., 2007
Cheraif, I.; Ben Jannet, H.; Hammami, M.; Khouja, M.L.; Mighri, Z., Chemical composition and antimicrobial activity of essential oils of Cupressus arizonica Greene, Biochem. Syst. Ecol., 2007, 35, 12, 813-820, https://doi.org/10.1016/j.bse.2007.05.009 . [all data]

Marongiu, Porcedda, et al., 2003
Marongiu, B.; Porcedda, S.; Caredda, A.; de Gioannis, B.; Vargiu, L.; la Colla, P., Extraction of Juniperus oxycedrus ssp. Oxycedrus essential oil by supercritical carbon dioxide: influence of some process parameters and biological activity, Flavour Fragr. J., 2003, 18, 5, 390-397, https://doi.org/10.1002/ffj.1224 . [all data]