8-Isobutyryloxy isobornyl isobutyrate

Kovats' RI, non-polar column, temperature ramp

View large format table.

Column type Active phase I Reference Comment
CapillaryDB-51869.Marongiu, Piras, et al., 200330. m/0.25 mm/0.25 μm, He, 3. K/min, 240. C @ 30. min; Tstart: 60. C
CapillaryDB-51866.Marongiu, Piras, et al., 200330. m/0.25 mm/0.25 μm, He, 3. K/min, 240. C @ 30. min; Tstart: 60. C

References

Marongiu, Piras, et al., 2003
Marongiu, B.; Piras, A.; Pani, F.; Porcedda, S.; Ballero, M., Extraction, separation and isolation of essential oils from natural matrices by supercritical CO2, Flavour Fragr. J., 2003, 18, 6, 505-509, https://doi.org/10.1002/ffj.1258 . [all data]