7,7-Dimethylbicyclo[3.3.0]octan-2-one

Van Den Dool and Kratz RI, non-polar column, temperature ramp

Data compiled by: NIST Mass Spectrometry Data Center, William E. Wallace, director

Column type CapillaryCapillary
Active phase HP-5MSHP-5MS
Column length (m) 60.60.
Carrier gas HeHe
Substrate
Column diameter (mm) 0.250.25
Phase thickness (μm) 0.250.25
Tstart (C) 40.40.
Tend (C) 310.310.
Heat rate (K/min) 3.3.
Initial hold (min) 1.1.
Final hold (min) 20.20.
I 1378.1376.
ReferenceLalel, Singh, et al., 2003Lalel, Singh, et al., 2003
Comment MSDC-RI MSDC-RI

References

Lalel, Singh, et al., 2003
Lalel, H.J.D.; Singh, Z.; Chye Tan, S., Glycosidically-bound aroma volatile compounds in the skin and pulp of 'Kensington Pride' mango fruit at different stages of maturity, Postharvest Biol. Technol., 2003, 29, 2, 205-218, https://doi.org/10.1016/S0925-5214(02)00250-8 . [all data]