p-Mentha-3-en-8-ol

Van Den Dool and Kratz RI, non-polar column, temperature ramp

View large format table.

Column type Active phase I Reference Comment
CapillaryDB-51149.Javidnia, Miri, et al., 2003He, 4. K/min; Column length: 25. m; Column diameter: 0.25 mm; Tstart: 60. C; Tend: 260. C

References

Javidnia, Miri, et al., 2003
Javidnia, K.; Miri, R.; Azarpira, A.; Tabaei, S.M.H., Composition of the essential oil of Stachys setifera C.A. Mey ssp. iranica growing in Iran, Flavour Fragr. J., 2003, 18, 4, 299-300, https://doi.org/10.1002/ffj.1165 . [all data]