Cembrene C

Normal alkane RI, non-polar column, custom temperature program

Data compiled by: NIST Mass Spectrometry Data Center, William E. Wallace, director

Column type CapillaryCapillaryCapillary
Active phase DB-5DB-5DB-5
Column length (m) 30.30.30.
Carrier gas HeHeHe
Substrate
Column diameter (mm) 0.250.250.25
Phase thickness (μm) 0.250.250.25
Program 40C(1min) => 9C/min => 130C => 2C/min => 230C40C(1min) => 9C/min => 130C => 2C/min => 230C40C (1min) => 9C/min => 130C => 2C/min => 230C
I 2002.2002.2002.
ReferenceHamm, Bleton, et al., 2005Hamm, Bleton, et al., 2004Hamm, Lesellier, et al., 2003
Comment MSDC-RI MSDC-RI MSDC-RI

References

Hamm, Bleton, et al., 2005
Hamm, S.; Bleton, J.; Connan, J.; Tchapla, A., A chemical investigation by headspace SPME and GC-MS of volatile and semi-volatile terpenes in various olibanum samples, Phytochemistry, 2005, 66, 12, 1499-1514, https://doi.org/10.1016/j.phytochem.2005.04.025 . [all data]

Hamm, Bleton, et al., 2004
Hamm, S.; Bleton, J.; Tchapla, A., Headspace solid phase microextraction for screening for the presence of resins in Egyptian archaeological samples, J. Sep. Sci., 2004, 27, 3, 235-243, https://doi.org/10.1002/jssc.200301611 . [all data]

Hamm, Lesellier, et al., 2003
Hamm, S.; Lesellier, E.; Bleton, J.; Tchapla, A., Optimization of headspace solid phase microextraction for gas chromatography/mass spectrometry analysis of widely different volatility and polarity terpenoids in olibanum, J. Chromatogr. A, 2003, 1018, 1, 73-83, https://doi.org/10.1016/j.chroma.2003.08.027 . [all data]