3,7-Guaiadiene

Normal alkane RI, polar column, custom temperature program

Data compiled by: NIST Mass Spectrometry Data Center, William E. Wallace, director

Column type CapillaryCapillaryCapillaryCapillaryCapillary
Active phase HP-Innowax FSCInnowax FSCInnowax FSCHP-Innowax FSCHP-Innowax FSC
Column length (m) 60.60.60.60.60.
Carrier gas N2HeHeHeHe
Substrate
Column diameter (mm) 0.250.250.250.250.25
Phase thickness (μm) 0.250.250.250.250.25
Program 60C(10min) => 4C/min => 220C(10min) => 1C/min => 240C60C(10min) => 4C/min >220C (10min) => 1C/min => 240C60C(10min) => 4C/min >220C (10min) => 1C/min => 240C60C(10min) => 4C/min => 220C (10min) => 1C/min => 240C60C(10min) => 4C/min => 220C(10min) => 1C/min => 240C
I 1810.1810.1810.1810.1811.
ReferenceBaser K.H.C. and Demirci B., 2007Baser, Özek, et al., 2006Baser, Özek, et al., 2006Erdurak, Coskun, et al., 2006Sezik E., Kocakulak E., et al., 2005
Comment MSDC-RI MSDC-RI MSDC-RI MSDC-RI MSDC-RI
Column type CapillaryCapillaryCapillaryCapillaryCapillary
Active phase HP-Innowax FSCHP-Innowax FSCHP-Innowax FSCInnowaxInnowax FSC
Column length (m) 60.60.60.60.60.
Carrier gas N2HeHeHeHe
Substrate
Column diameter (mm) 0.250.250.250.250.25
Phase thickness (μm) 0.250.250.250.250.25
Program 60C(10min) => 4C/min => 220C(10min) => 1C/min => 240C60C(10min) => 4C/min => 220C(10min) => 1C/min => 240C60C (10min) => 4C/min => 220C (10min) => 1C/min => 240C60C(10min) => 4C/min => 220C(10min) => 1C/min => 240C (20min)60C(10min) => 4C/min => 220C(10min) => 1C/min => 240C
I 1810.1810.1810.1810.1810.
ReferenceDemirci, Paper, et al., 2004Kivcak, Akay, et al., 2004Demirci, Baser, et al., 2003Tunaher, Kirimer, et al., 2003Baser, Demirei, et al., 2002
Comment MSDC-RI MSDC-RI MSDC-RI MSDC-RI MSDC-RI
Column type CapillaryCapillary
Active phase HP-InnowaxInnowax FSC
Column length (m) 60.60.
Carrier gas HeHe
Substrate
Column diameter (mm) 0.250.25
Phase thickness (μm) 0.250.25
Program 60C(10min) => 4C/min => 220C(10min) => 1C/min => 240C60C(10 min) => 4C/min => 220C(10min) => 1C/min => 240C
I 1810.1811.
ReferenceTabanca, Kirimer, et al., 2001Kirimer, Tabanca, et al., 2000
Comment MSDC-RI MSDC-RI

Normal alkane RI, non-polar column, temperature ramp

Data compiled by: NIST Mass Spectrometry Data Center, William E. Wallace, director

Column type Capillary
Active phase HP-5MS
Column length (m) 25.
Carrier gas He
Substrate
Column diameter (mm) 0.25
Phase thickness (μm)
Tstart (C) 50.
Tend (C) 250.
Heat rate (K/min) 3.
Initial hold (min) 3.
Final hold (min) 10.
I 1442.
ReferenceGhasemi Y., Faridi P., et al., 2005
Comment MSDC-RI

References

Baser K.H.C. and Demirci B., 2007
Baser K.H.C.; Demirci B., Studies on Betula essential oils, Arkivoc, 2007, 7, 335-348. [all data]

Baser, Özek, et al., 2006
Baser, K.H.C.; Özek, G.; Özek, T.; Duran, A.; Duman, H., Composition of the essential oils of Rhabdosciadium oligocarpum (Post ex Boiss.) Hedge et Lamond and Rhabdosciadium microcalycinum Hand.-Mazz., Flavour Fragr. J., 2006, 21, 4, 650-655, https://doi.org/10.1002/ffj.1639 . [all data]

Erdurak, Coskun, et al., 2006
Erdurak, C.S.; Coskun, M.; Demirci, B.; Baser, K.H.C., Composition of the essential oil of fruits and roots of Ferulago isaurica Pesmen and F. syriaca Boiss. (Umbelliferae) from Turkey, Flavour Fragr. J., 2006, 21, 1, 118-121, https://doi.org/10.1002/ffj.1540 . [all data]

Sezik E., Kocakulak E., et al., 2005
Sezik E.; Kocakulak E.; Baser K.H.C.; Ozek T., Composition of the essential oils of Juniperus oxycedrus subsp macrocarpa from Turkey, Chem. Nat. Compd. (Engl. Transl.), 2005, 41, 3, 352-354, https://doi.org/10.1007/s10600-005-0149-0 . [all data]

Demirci, Paper, et al., 2004
Demirci, F.; Paper, D.H.; Demirci, F.; Hüsnü Can Baser, K.; Franz, G., Essential oil of Betula pendula Roth. buds, eCAM, 2004, 1, 3, 301-303. [all data]

Kivcak, Akay, et al., 2004
Kivcak, B.; Akay, S.; Demirci, B.; Baser, K.H.C., Chemical composition of essential oils from leaves and twigs of Pistacia lentiscus, Pistacia lentiscus var. chia, and Pistacia terebinthus from Turkey, Pharm. Biol, 2004, 42, 4-5, 360-366, https://doi.org/10.1080/13880200490519677 . [all data]

Demirci, Baser, et al., 2003
Demirci, B.; Baser, K.H.C.; Yildiz, B.; Bahcecioglu, Z., Composition of the essential oils of six endemic Salvia spp. from Turkey, Flavour Fragr. J., 2003, 18, 2, 116-121, https://doi.org/10.1002/ffj.1173 . [all data]

Tunaher, Kirimer, et al., 2003
Tunaher, Z.; Kirimer, N.; Baser, K.H.C., Wood essential oils of Juniperus foetidissima Willd., Holzforschung, 2003, 57, 140-144. [all data]

Baser, Demirei, et al., 2002
Baser, K.H.C.; Demirei, B.; Özek, T.; Akalin, E.; Özhatay, N., Micro-distilled volatile compounds from Ferulago species growing in Western Turkey, Pharm. Biol., 2002, 40, 6, 466-471, https://doi.org/10.1076/phbi.40.6.466.8439 . [all data]

Tabanca, Kirimer, et al., 2001
Tabanca, N.; Kirimer, N.; Demirci, B.; Demirci, F.; Can Baser, K.H., Composition and antimicrobial activity of the essential oils of Micromeria cristata subsp. phrygia and the enantiomeric distribution of borneol, J. Agric. Food Chem., 2001, 49, 9, 4300-4303, https://doi.org/10.1021/jf0105034 . [all data]

Kirimer, Tabanca, et al., 2000
Kirimer, N.; Tabanca, N.; Özek, T.; Tümen, G.; Baser, K.H.C., Essential oils of annual Sideritis species growing in Turkey, Pharm. Biol., 2000, 38, 2, 106-111, https://doi.org/10.1076/1388-0209(200004)3821-1FT106 . [all data]