5-Eudesmen-1-ol

Van Den Dool and Kratz RI, non-polar column, temperature ramp

View large format table.

Column type Active phase I Reference Comment
CapillaryDB-51607.Flamini, Cioni, et al., 200330. m/0.25 mm/0.25 μm, He, 3. K/min; Tstart: 60. C; Tend: 240. C

References

Flamini, Cioni, et al., 2003
Flamini, G.; Cioni, P.L.; Morelli, I.; Ceccarini, L.; Andolfi, L.; Macchia, M., Composition of the essential oil of Medicago marina L. from the coastal dunes of Tuscany, Italy, Flavour Fragr. J., 2003, 18, 5, 460-462, https://doi.org/10.1002/ffj.1253 . [all data]