(Z)-methyl jasmonate

Normal alkane RI, non-polar column, temperature ramp

Data compiled by: NIST Mass Spectrometry Data Center, William E. Wallace, director

Column type Capillary
Active phase RTX-5Sil
Column length (m) 30.
Carrier gas He
Substrate
Column diameter (mm) 0.25
Phase thickness (μm) 0.25
Tstart (C) 70.
Tend (C) 200.
Heat rate (K/min) 4.
Initial hold (min)
Final hold (min) 10.
I 1624.
ReferenceDudai, Larkov, et al., 2003
Comment MSDC-RI

Normal alkane RI, non-polar column, custom temperature program

Data compiled by: NIST Mass Spectrometry Data Center, William E. Wallace, director

Column type Capillary
Active phase DB-1
Column length (m) 30.
Carrier gas Helium
Substrate
Column diameter (mm) 0.25
Phase thickness (μm) 0.25
Program 35 0C 4 0C/min -> 180 0C 10 0C/min -> 250 0C
I 1649.
ReferenceSilva, Matos, et al., 2004
Comment MSDC-RI

References

Dudai, Larkov, et al., 2003
Dudai, N.; Larkov, O.; Chaimovitsh, D.; Lewinsohn, E.; Freiman, L.; Ravid, U., Essential oil compounds of Origanum dayi Post, Flavour Fragr. J., 2003, 18, 4, 334-337, https://doi.org/10.1002/ffj.1237 . [all data]