3,7,11,15-Tetramethyl-2-hexadecene

Normal alkane RI, polar column, custom temperature program

Data compiled by: NIST Mass Spectrometry Data Center, William E. Wallace, director

Column type CapillaryCapillary
Active phase Supelcowax-10Supelcowax-10
Column length (m) 60.60.
Carrier gas HeHe
Substrate
Column diameter (mm) 0.320.32
Phase thickness (μm) 0.250.25
Program 35C(3min) => 5C/min => 110C => 10C/min => 240C (10min)35C(3min) => 5C/min => 110C => 10C/min => 240C (10min)
I 1884.1926.
ReferenceKourkoutas, Bosnea, et al., 2006Kourkoutas, Kandylis, et al., 2006
Comment MSDC-RI MSDC-RI

References

Kourkoutas, Bosnea, et al., 2006
Kourkoutas, Y.; Bosnea, L.; Taboukos, S.; Baras, C.; Lambrou, D.; Kanellaki, M., Probiotic Cheese Production Using Lactobacillus casei Cells Immobilized on Fruit Pieces, J. Dairy Sci., 2006, 89, 5, 1439-1451, https://doi.org/10.3168/jds.S0022-0302(06)72212-3 . [all data]

Kourkoutas, Kandylis, et al., 2006
Kourkoutas, Y.; Kandylis, P.; Panas, P.; Dooley, J.S.G.; Nigam, P.; Koutinas, A.A., Evaluation of freeze-dried kefir coculture as starter in feta-type cheese production, Appl. Environ. Microbiol., 2006, 72, 9, 6124-6135, https://doi.org/10.1128/AEM.03078-05 . [all data]