(Z)-6-Tridecenal

Van Den Dool and Kratz RI, non-polar column, temperature ramp

View large format table.

Column type Active phase I Reference Comment
CapillarySPB-11471.Chisholm, Jell, et al., 200330. m/0.25 mm/0.25 μm, He, 35. C @ 5. min, 4. K/min, 225. C @ 20. min

References

Chisholm, Jell, et al., 2003
Chisholm, M.G.; Jell, J.A.; Cass, D.M., Jr., Characterization of the major odorants found in the peel oil of Citrus reticulata Blanco cv. Clementine using gas chromatography-olfactometry, Flavour Fragr. J., 2003, 18, 4, 275-281, https://doi.org/10.1002/ffj.1188 . [all data]