(Z)-4,8-dimethylnona-1,3,7-triene

Van Den Dool and Kratz RI, non-polar column, temperature ramp

Data compiled by: NIST Mass Spectrometry Data Center, William E. Wallace, director

Column type CapillaryCapillaryCapillary
Active phase HP-1HP-1HP-1
Column length (m) 50.50.50.
Carrier gas HeHeHe
Substrate
Column diameter (mm) 0.20.20.2
Phase thickness (μm) 0.330.330.33
Tstart (C) 60.60.60.
Tend (C) 250.250.250.
Heat rate (K/min) 2.2.2.
Initial hold (min) 5.5.5.
Final hold (min) 20.20.20.
I 1092.1090.1097.
ReferenceCavalli, Fernandez, et al., 2003Cavalli, Fernandez, et al., 2003Cavalli, Fernandez, et al., 2003
Comment MSDC-RI MSDC-RI MSDC-RI

References

Cavalli, Fernandez, et al., 2003
Cavalli, J.-F.; Fernandez, X.; Lizzani-Cuvelier, L.; Loiseau, A.-M., Comparison of static headspace, headspace solid phase microextraction, headspace sorptive extraction, and direct thermal desorption techniques on chemical composition of French olive oils, J. Agric. Food Chem., 2003, 51, 26, 7709-7716, https://doi.org/10.1021/jf034834n . [all data]