Benzylpiperazine-M (desethylene-), 2AC

Kovats' RI, non-polar column, temperature ramp

View large format table.

Column type Active phase I Reference Comment
CapillaryCross-Linked Methylsilicone2110.Staack, Fritschi, et al., 200212. m/0.2 mm/0.33 μm, He, 100. C @ 3. min, 30. K/min, 300. C @ 8. min

References

Staack, Fritschi, et al., 2002
Staack, R.F.; Fritschi, G.; Maurer, H.H., Studies on the metabolism and toxicological detection of the new designer drug N-benzylpiperazine in urine using gas chromatography-mass spectrometry, J. Chromatogr. B, 2002, 773, 1, 35-46, https://doi.org/10.1016/S1570-0232(01)00619-5 . [all data]