Isogeranyl formate

Van Den Dool and Kratz RI, non-polar column, temperature ramp

View large format table.

Column type Active phase I Reference Comment
CapillaryHP-5MS1266.Shang, Hu, et al., 200230. m/0.25 mm/0.25 μm, He, 50. C @ 2. min, 5. K/min, 250. C @ 5. min

References

Shang, Hu, et al., 2002
Shang, C.; Hu, Y.; Deng, C.; Hu, K., Rapid determination of volatile constituents of Michelia alba flowers by gas chromatography-mass spectrometry with solid-phase microextraction, J. Chromatogr. A, 2002, 942, 1-2, 283-288, https://doi.org/10.1016/S0021-9673(01)01382-6 . [all data]