Eudesma-4(15),7-dien-l-β-ol
- Formula: C15H24O
- Molecular weight: 220.3505
- IUPAC Standard InChIKey: FGPDTARJOXRWJD-FGRDXJNISA-N
- Chemical structure:

Kovats' RI, non-polar column, temperature ramp

Column type | Active phase | I | Reference | Comment |
---|---|---|---|---|
Capillary | HP-5MS | 1685. | Salido, Altarejos, et al., 2002 | 30. m/0.25 mm/0.25 μm, He, 3. K/min; Tstart: 50. C; Tend: 250. C |

References

Salido, Altarejos, et al., 2002
Salido, S.; Altarejos, J.; Nogueras, M.; Sánchez, A.; Pannecouque, C.; Witvrouw, M.; De Clercq, E.,
Chemical studies of essential oils of Juniperus oxycedrus ssp. badia,
J. Ethnopharmacol., 2002, 81, 1, 129-134, https://doi.org/10.1016/S0378-8741(02)00045-4
. [all data]