6-Camphenone

Kovats' RI, non-polar column, temperature ramp

View large format table.

Column type Active phase I Reference Comment
CapillaryHP-5MS1095.Asuming, Beauchamp, et al., 200530. m/0.25 mm/0.25 μm, He, 50. C @ 10. min, 3. K/min, 250. C @ 5. min
CapillaryHP-5MS1066.Gkinis, Tzakou, et al., 200330. m/0.25 mm/0.25 μm, He, 3. K/min; Tstart: 60. C; Tend: 280. C
CapillaryHP-5MS1093.Salido, Altarejos, et al., 200230. m/0.25 mm/0.25 μm, He, 3. K/min; Tstart: 50. C; Tend: 250. C

Normal alkane RI, non-polar column, temperature ramp

View large format table.

Column type Active phase I Reference Comment
CapillaryDB-11082.Palá-Paúl, Pérez-Alonso, et al., 200550. m/0.25 mm/0.25 μm, N2, 4. K/min; Tstart: 95. C; Tend: 240. C
CapillaryDB-51093.Pino, Marbot, et al., 200330. m/0.25 mm/0.25 μm, H2, 60. C @ 10. min, 4. K/min, 280. C @ 40. min
CapillarySPB-51098.Doneanu and Anitescu, 199850. m/0.32 mm/0.25 μm, He, 3. K/min, 240. C @ 20. min; Tstart: 60. C

References

Asuming, Beauchamp, et al., 2005
Asuming, W.A.; Beauchamp, P.S.; Descalzo, J.T.; Dev, B.C.; Dev, V.; Frost, S.; Ma, C.W., Essential oil composition of four Lomatium Raf. species and their chemotaxonomy, Biochem. Syst. Ecol., 2005, 33, 1, 17-26, https://doi.org/10.1016/j.bse.2004.06.005 . [all data]

Gkinis, Tzakou, et al., 2003
Gkinis, G.; Tzakou, O.; Iliopoulou, D.; Roussis, V., Chemical Composition and Biological Activity of Nepeta parnassica Oils and Isolated Nepetalactones, Z. Naturforsch. C:, 2003, 58, 681-686. [all data]

Salido, Altarejos, et al., 2002
Salido, S.; Altarejos, J.; Nogueras, M.; Sánchez, A.; Pannecouque, C.; Witvrouw, M.; De Clercq, E., Chemical studies of essential oils of Juniperus oxycedrus ssp. badia, J. Ethnopharmacol., 2002, 81, 1, 129-134, https://doi.org/10.1016/S0378-8741(02)00045-4 . [all data]

Palá-Paúl, Pérez-Alonso, et al., 2005
Palá-Paúl, J.; Pérez-Alonso, M.; Velasco-Negueruela, A.; Vadaré, J.; Villa, A.M.; Sanz, J.; Brophy, J.J., Analysis of the essential oil composition from the different parts of Eryngium glaciale Boiss. from Spain, J. Chromatogr. A, 2005, 1094, 1-2, 179-182, https://doi.org/10.1016/j.chroma.2005.09.029 . [all data]

Pino, Marbot, et al., 2003
Pino, J.A.; Marbot, R.; Fuentes, V., Characterization of volatiles in Bullock's heart (Annona reticulata L.) fruit cultivars from Cuba, J. Agric. Food Chem., 2003, 51, 13, 3836-3839, https://doi.org/10.1021/jf020733y . [all data]

Doneanu and Anitescu, 1998
Doneanu, C.; Anitescu, G., Supercritical carbon dioxide extraction of Angelica archangelica L. root oil, J. Supercrit. Fluids, 1998, 12, 1, 59-67, https://doi.org/10.1016/S0896-8446(97)00040-5 . [all data]