5-methyl-2-propylfuran

Van Den Dool and Kratz RI, polar column, custom temperature program

Data compiled by: NIST Mass Spectrometry Data Center, William E. Wallace, director

Column type CapillaryCapillaryCapillaryCapillaryCapillary
Active phase CarbowaxCarbowaxCarbowaxCarbowaxCarbowax
Column length (m)
Carrier gas
Substrate
Column diameter (mm) 0.30.30.30.30.3
Phase thickness (μm)
Program not specifiednot specifiednot specifiednot specifiednot specified
I 1085.1085.1086.1086.1088.
ReferenceBaltes w. and Bochmann G., 1987Baltes w. and Bochmann G., 1987Baltes w. and Bochmann G., 1987Baltes w. and Bochmann G., 1987Baltes w. and Bochmann G., 1987
Comment MSDC-RI MSDC-RI MSDC-RI MSDC-RI MSDC-RI
Column type Capillary
Active phase Carbowax 20M
Column length (m) 50.
Carrier gas
Substrate
Column diameter (mm) 0.3
Phase thickness (μm)
Program not specified
I 1086.
ReferenceBaltes and Bochmann, 1987
Comment MSDC-RI

References

Baltes w. and Bochmann G., 1987
Baltes w.; Bochmann G., Model reactions on roast aroma formation. II. Mass spectrometric identification of furans and furanones from the reaction of serine and threonine with sucrose under the conditions of coffee roasting, Z. Lebensm. Unters. Forsch., 1987, 184, 179-186. [all data]

Baltes and Bochmann, 1987
Baltes, W.; Bochmann, G., Model reactions on roast aroma formation. 1. Reaction of serine and threonine with sucrose under the conditions of coffee roasting and identification of new coffee aroma compounds, J. Agric. Food Chem., 1987, 35, 3, 340-346, https://doi.org/10.1021/jf00075a015 . [all data]