5-mercaptohexan-3-one

Normal alkane RI, polar column, custom temperature program

Data compiled by: NIST Mass Spectrometry Data Center, William E. Wallace, director

Column type Capillary
Active phase FFAP
Column length (m) 25.
Carrier gas
Substrate
Column diameter (mm) 0.32
Phase thickness (μm) 0.3
Program 40C(4min) => 2C/min => 132C => 10C/min => 250C(15min)
I 1487.
ReferenceVermeulen, Guyot-Declerck, et al., 2003
Comment MSDC-RI

References

Vermeulen, Guyot-Declerck, et al., 2003
Vermeulen, C.; Guyot-Declerck, C.; Collin, S., Combinatorial synthesis and sensorial properties of mercapto primary alcohols and analogues, J. Agric. Food Chem., 2003, 51, 12, 3623-3628, https://doi.org/10.1021/jf0212340 . [all data]