4-mercapto-3-methylpentan-2-ol

Normal alkane RI, non-polar column, custom temperature program

View large format table.

Column type Active phase I Reference Comment
Capillary5 % Phenyl methyl siloxane1063.Kleinhenz, Kuo, et al., 2006Program: not specified
CapillaryCP Sil 5 CB1022.Vermeulen, Guyot-Declerck, et al., 200350. m/0.32 mm/1.2 μm, He; Program: 40C(4min) => 2C/min => 132C => 10C/min => 250C(45min)
CapillaryCP Sil 5 CB1037.Vermeulen, Guyot-Declerck, et al., 200350. m/0.32 mm/1.2 μm, He; Program: 40C(4min) => 2C/min => 132C => 10C/min => 250C(45min)
CapillaryCP Sil 5 CB1037.Vermeulen, Pellaud, et al., 200150. m/0.32 mm/1.2 μm, He; Program: 40C(4min) => 2C/min => 132C => 10C/min => 250(45min)

Normal alkane RI, polar column, custom temperature program

View large format table.

Column type Active phase I Reference Comment
CapillaryFFAP1671.Vermeulen, Guyot-Declerck, et al., 200325. m/0.32 mm/0.3 μm; Program: 40C(4min) => 2C/min => 132C => 10C/min => 250C(15min)
CapillaryFFAP1677.Vermeulen, Guyot-Declerck, et al., 200325. m/0.32 mm/0.3 μm; Program: 40C(4min) => 2C/min => 132C => 10C/min => 250C(15min)
CapillaryFFAP1687.Vermeulen, Guyot-Declerck, et al., 200325. m/0.32 mm/0.3 μm; Program: 40C(4min) => 2C/min => 132C => 10C/min => 250C(15min)

References

Kleinhenz, Kuo, et al., 2006
Kleinhenz, J.K.; Kuo, C.J.; Harper., W.J., Evaluation of polyfunctional thiol compounds in aged Cheddar cheese: identification, Milchwissenschaft, 2006, 61, 3, 300-304. [all data]

Vermeulen, Guyot-Declerck, et al., 2003
Vermeulen, C.; Guyot-Declerck, C.; Collin, S., Combinatorial synthesis and sensorial properties of mercapto primary alcohols and analogues, J. Agric. Food Chem., 2003, 51, 12, 3623-3628, https://doi.org/10.1021/jf0212340 . [all data]

Vermeulen, Pellaud, et al., 2001
Vermeulen, C.; Pellaud, J.; Gijs, L.; Collin, S., Combinatorial synthesis and sensorial properties of polyfunctional thiols, J. Agric. Food Chem., 2001, 49, 11, 5445-5449, https://doi.org/10.1021/jf010816z . [all data]